Target
D(1A) dopamine receptor
Ligand
BDBM436044
Substrate
Meas. Tech.
ChEMBL_1838592 (CHEMBL4338725)
EC50
540±n/a nM
Citation
 Rosse, G Novel Pyrazolyl-dihydroisoquinolines as Positive Allosteric Modulator of the Dopamine D1 Receptor. ACS Med Chem Lett 11:0 (2020)  
Target
Name:
D(1A) dopamine receptor
Synonyms:
DA D1 receptor DRD1 Dopamine D1 receptor Dopamine D1A
Type:
Enzyme
Mol. Mass.:
49303.43
Organism:
Homo sapiens (Human)
Description:
P21728
Residue:
446
  
Inhibitor
Name:
BDBM436044
Synonyms:
2-(2-chloro-4-fluorophenyl)-1- ((1S,3R)-3-(hydroxymethyl)-1- methyl-5-(1H-pyrazol-4-yl)- 3,4-dihydroisoquinolin-2(1H)- yl)ethan-1-one | US10611751, Example 12
Type:
Small organic molecule
Emp. Form.:
C22H21ClFN3O2
Mol. Mass.:
413.872
SMILES:
C[C@@H]1N([C@@H](CO)Cc2c1cccc2-c1cn[nH]c1)C(=O)Cc1ccc(F)cc1Cl
: