Target
Steroid 17-alpha-hydroxylase/17,20 lyase
Ligand
BDBM50063478
Substrate
Meas. Tech.
ChEMBL_50385 (CHEMBL662841)
Ki
41±n/a nM
Citation
 Njar, VCKato, KNnane, IPGrigoryev, DNLong, BJBrodie, AM Novel 17-azolyl steroids, potent inhibitors of human cytochrome 17 alpha-hydroxylase-C17,20-lyase (P450(17) alpha): potential agents for the treatment of prostate cancer. J Med Chem 41:902-12 (1998)  
Target
Name:
Steroid 17-alpha-hydroxylase/17,20 lyase
Synonyms:
CP17A_HUMAN CYP17A1 Cytochrome P450 17A1 Cytochrome P450 C17 (CYP17) Cytochrome P450-C17 P450-C17 Steroid 17-alpha-Monooxygenase (CYP17) Steroid 17-alpha-monooxygenase | cytochrome P450 monooxygenase 17 alpha hydroxylase/17,20-lyase (CYP17)
Type:
Enzyme
Mol. Mass.:
57382.42
Organism:
Homo sapiens (Human)
Description:
E.coli expressing human CYP17
Residue:
508
  
Inhibitor
Name:
BDBM50063478
Synonyms:
(10R,13S)-10,13-Dimethyl-17-[1,2,4]triazol-1-yl-1,2,6,7,8,9,10,11,12,13,14,15-dodecahydro-cyclopenta[a]phenanthren-3-one | CHEMBL307729
Type:
Small organic molecule
Emp. Form.:
C21H27N3O
Mol. Mass.:
337.4586
SMILES:
C[C@]12CCC3C(CCC4=CC(=O)CC[C@]34C)C1CC=C2n1cncn1
: