Target
Epithelial discoidin domain-containing receptor 1
Ligand
BDBM50297825
Substrate
Meas. Tech.
ChEMBL_1838637 (CHEMBL4338770)
IC50
12±n/a nM
Citation
 Jeffries, DEBorza, CMBlobaum, ALPozzi, ALindsley, CW Discovery of VU6015929: A Selective Discoidin Domain Receptor 1/2 (DDR1/2) Inhibitor to Explore the Role of DDR1 in Antifibrotic Therapy. ACS Med Chem Lett 11:29-33 (2020)  
Target
Name:
Epithelial discoidin domain-containing receptor 1
Synonyms:
CAK DDR1_HUMAN Discoidin domain-containing receptor 1 (DDR1) EDDR1 Epithelial discoidin domain receptor 1 (DDR1) Epithelial discoidin domain-containing receptor 1 (DDR1) Mammary carcinoma kinase 10 NTRK4 Protein-tyrosine kinase RTK 6 TRKE | Tyrosine-protein kinase CAK
Type:
Tyrosine-protein kinase
Mol. Mass.:
101130.02
Organism:
Homo sapiens (Human)
Description:
Q08345
Residue:
913
  
Inhibitor
Name:
BDBM50297825
Synonyms:
5-(2-methyl-5-(3-(trifluoromethyl)phenylcarbamoyl)phenylamino)nicotinamide 5-[(2-methyl-5-{[3-(trifluoromethyl)phenyl]carbamoyl}phenyl)amino]pyridine-3-carboxamide | CHEMBL552425
Type:
Small organic molecule
Emp. Form.:
C21H17F3N4O2
Mol. Mass.:
414.3805
SMILES:
Cc1ccc(cc1Nc1cncc(c1)C(N)=O)C(=O)Nc1cccc(c1)C(F)(F)F
: