Target
Histone-lysine N-methyltransferase SMYD3
Ligand
BDBM50509612
Substrate
Meas. Tech.
ChEMBL_1838817 (CHEMBL4338950)
IC50
<1.000000±n/a nM
Citation
 Su, DSQu, JSchulz, MBlackledge, CWYu, HZeng, JBurgess, JReif, AStern, MNagarajan, RPappalardi, MBWong, KGraves, APBonnette, WWang, LElkins, PKnapp-Reed, BCarson, JDMcHugh, CMohammad, HKruger, RLuengo, JHeerding, DACreasy, CL Discovery of Isoxazole Amides as Potent and Selective SMYD3 Inhibitors. ACS Med Chem Lett 11:133-140 (2020)  
Target
Name:
Histone-lysine N-methyltransferase SMYD3
Synonyms:
SET and MYND domain-containing protein 3 SMYD3_HUMAN ZNFN3A1 | Zinc finger MYND domain-containing protein 1
Type:
Enzyme
Mol. Mass.:
49101.22
Organism:
Homo sapiens (Human)
Description:
Q9H7B4-2
Residue:
428
  
Inhibitor
Name:
BDBM50509612
Synonyms:
CHEMBL4532881
Type:
Small organic molecule
Emp. Form.:
C27H38N4O4S
Mol. Mass.:
514.68
SMILES:
Cc1ccccc1CN[C@H]1CC[C@H](CS(=O)(=O)N2CCC(CC2)NC(=O)c2cc(on2)C2CC2)CC1
: