Target
Transporter
Ligand
BDBM50063544
Substrate
Meas. Tech.
ChEMBL_142949 (CHEMBL750801)
IC50
2375±n/a nM
Citation
 Parker, MAMarona-Lewicka, DKurrasch, DShulgin, ATNichols, DE Synthesis and pharmacological evaluation of ring-methylated derivatives of 3,4-(methylenedioxy)amphetamine (MDA). J Med Chem 41:1001-5 (1998)  
Target
Name:
Transporter
Synonyms:
Monoamine transporters; Norepininephrine & dopamine | Norepinephrine Monoamine transporters
Type:
PROTEIN
Mol. Mass.:
66787.87
Organism:
Rattus norvegicus
Description:
ChEMBL_1463061
Residue:
597
  
Inhibitor
Name:
BDBM50063544
Synonyms:
1-(6-(methylthio)naphthalen-2-yl)propan-2-amine 2-Amino-1-(4-methylthiophenyl)propane | CHEMBL6467
Type:
Small organic molecule
Emp. Form.:
C10H15NS
Mol. Mass.:
181.298
SMILES:
CSc1ccc(CC(C)N)cc1
: