Target
Sodium-dependent serotonin transporter
Ligand
BDBM50003582
Substrate
Meas. Tech.
ChEMBL_201505 (CHEMBL873243)
IC50
82±n/a nM
Citation
 Parker, MAMarona-Lewicka, DKurrasch, DShulgin, ATNichols, DE Synthesis and pharmacological evaluation of ring-methylated derivatives of 3,4-(methylenedioxy)amphetamine (MDA). J Med Chem 41:1001-5 (1998)  
Target
Name:
Sodium-dependent serotonin transporter
Synonyms:
5-HT Transporter 5HT transporter Anandamid membrane transporter, AMT Monoamine transporters; Norepinephrine & serotonin Slc6a4 Sodium-dependent serotonin transporter (SERT) | imipramine receptor
Type:
Multi-pass membrane protein
Mol. Mass.:
70168.43
Organism:
Rattus norvegicus (rat)
Description:
P31652
Residue:
630
  
Inhibitor
Name:
BDBM50003582
Synonyms:
(R-PIA)2-(4-Iodo-phenyl)-1-methyl-ethylamine CHEMBL6368
Type:
Small organic molecule
Emp. Form.:
C9H12IN
Mol. Mass.:
261.1028
SMILES:
CC(N)Cc1ccc(I)cc1
: