Target
Sodium-dependent serotonin transporter
Ligand
BDBM50063544
Substrate
Meas. Tech.
ChEMBL_201505 (CHEMBL873243)
IC50
74±n/a nM
Citation
 Parker, MAMarona-Lewicka, DKurrasch, DShulgin, ATNichols, DE Synthesis and pharmacological evaluation of ring-methylated derivatives of 3,4-(methylenedioxy)amphetamine (MDA). J Med Chem 41:1001-5 (1998)  
Target
Name:
Sodium-dependent serotonin transporter
Synonyms:
5-HT Transporter 5HT transporter Anandamid membrane transporter, AMT Monoamine transporters; Norepinephrine & serotonin Slc6a4 Sodium-dependent serotonin transporter (SERT) | imipramine receptor
Type:
Multi-pass membrane protein
Mol. Mass.:
70168.43
Organism:
Rattus norvegicus (rat)
Description:
P31652
Residue:
630
  
Inhibitor
Name:
BDBM50063544
Synonyms:
1-(6-(methylthio)naphthalen-2-yl)propan-2-amine 2-Amino-1-(4-methylthiophenyl)propane | CHEMBL6467
Type:
Small organic molecule
Emp. Form.:
C10H15NS
Mol. Mass.:
181.298
SMILES:
CSc1ccc(CC(C)N)cc1
: