Target
Transporter
Ligand
BDBM50063546
Substrate
Meas. Tech.
ChEMBL_142949 (CHEMBL750801)
IC50
1494±n/a nM
Citation
 Parker, MAMarona-Lewicka, DKurrasch, DShulgin, ATNichols, DE Synthesis and pharmacological evaluation of ring-methylated derivatives of 3,4-(methylenedioxy)amphetamine (MDA). J Med Chem 41:1001-5 (1998)  
Target
Name:
Transporter
Synonyms:
Monoamine transporters; Norepininephrine & dopamine | Norepinephrine Monoamine transporters
Type:
PROTEIN
Mol. Mass.:
66787.87
Organism:
Rattus norvegicus
Description:
ChEMBL_1463061
Residue:
597
  
Inhibitor
Name:
BDBM50063546
Synonyms:
1-Methyl-2-(7-methyl-benzo[1,3]dioxol-5-yl)-ethylamine | CHEMBL6330
Type:
Small organic molecule
Emp. Form.:
C11H15NO2
Mol. Mass.:
193.2423
SMILES:
CC(N)Cc1cc2OCOc2c(C)c1
: