Target
Sodium-dependent serotonin transporter
Ligand
BDBM50005247
Substrate
Meas. Tech.
ChEMBL_201505 (CHEMBL873243)
IC50
478.0±n/a nM
Citation
 Parker, MAMarona-Lewicka, DKurrasch, DShulgin, ATNichols, DE Synthesis and pharmacological evaluation of ring-methylated derivatives of 3,4-(methylenedioxy)amphetamine (MDA). J Med Chem 41:1001-5 (1998)  
Target
Name:
Sodium-dependent serotonin transporter
Synonyms:
5-HT Transporter 5HT transporter Anandamid membrane transporter, AMT Monoamine transporters; Norepinephrine & serotonin Slc6a4 Sodium-dependent serotonin transporter (SERT) | imipramine receptor
Type:
Multi-pass membrane protein
Mol. Mass.:
70168.43
Organism:
Rattus norvegicus (rat)
Description:
P31652
Residue:
630
  
Inhibitor
Name:
BDBM50005247
Synonyms:
(+/-)2-Benzo[1,3]dioxol-5-yl-1-methyl-ethylamine (R)-(-)-2-Benzo[1,3]dioxol-5-yl-1-methyl-ethylamine 2-Benzo[1,3]dioxol-5-yl-1-methyl-ethylamine 3,4-methylenedioxyamphetamine MDA MDA,R(-) methylenedioxyamphetamine
Type:
Small organic molecule
Emp. Form.:
C10H13NO2
Mol. Mass.:
179.2157
SMILES:
CC(N)Cc1ccc2OCOc2c1
: