Target
Transporter
Ligand
BDBM50042722
Substrate
Meas. Tech.
ChEMBL_142949 (CHEMBL750801)
IC50
849±n/a nM
Citation
 Parker, MAMarona-Lewicka, DKurrasch, DShulgin, ATNichols, DE Synthesis and pharmacological evaluation of ring-methylated derivatives of 3,4-(methylenedioxy)amphetamine (MDA). J Med Chem 41:1001-5 (1998)  
Target
Name:
Transporter
Synonyms:
Monoamine transporters; Norepininephrine & dopamine | Norepinephrine Monoamine transporters
Type:
PROTEIN
Mol. Mass.:
66787.87
Organism:
Rattus norvegicus
Description:
ChEMBL_1463061
Residue:
597
  
Inhibitor
Name:
BDBM50042722
Synonyms:
2-Indan-5-yl-1-methyl-ethylamine | CHEMBL6842
Type:
Small organic molecule
Emp. Form.:
C12H17N
Mol. Mass.:
175.2701
SMILES:
CC(N)Cc1ccc2CCCc2c1
: