Target
Transporter
Ligand
BDBM50003582
Substrate
Meas. Tech.
ChEMBL_142949 (CHEMBL750801)
IC50
993±n/a nM
Citation
 Parker, MAMarona-Lewicka, DKurrasch, DShulgin, ATNichols, DE Synthesis and pharmacological evaluation of ring-methylated derivatives of 3,4-(methylenedioxy)amphetamine (MDA). J Med Chem 41:1001-5 (1998)  
Target
Name:
Transporter
Synonyms:
Monoamine transporters; Norepininephrine & dopamine | Norepinephrine Monoamine transporters
Type:
PROTEIN
Mol. Mass.:
66787.87
Organism:
Rattus norvegicus
Description:
ChEMBL_1463061
Residue:
597
  
Inhibitor
Name:
BDBM50003582
Synonyms:
(R-PIA)2-(4-Iodo-phenyl)-1-methyl-ethylamine CHEMBL6368
Type:
Small organic molecule
Emp. Form.:
C9H12IN
Mol. Mass.:
261.1028
SMILES:
CC(N)Cc1ccc(I)cc1
: