Target
Sodium-dependent serotonin transporter
Ligand
BDBM50042722
Substrate
Meas. Tech.
ChEMBL_201505 (CHEMBL873243)
IC50
82±n/a nM
Citation
 Parker, MAMarona-Lewicka, DKurrasch, DShulgin, ATNichols, DE Synthesis and pharmacological evaluation of ring-methylated derivatives of 3,4-(methylenedioxy)amphetamine (MDA). J Med Chem 41:1001-5 (1998)  
Target
Name:
Sodium-dependent serotonin transporter
Synonyms:
5-HT Transporter 5HT transporter Anandamid membrane transporter, AMT Monoamine transporters; Norepinephrine & serotonin Slc6a4 Sodium-dependent serotonin transporter (SERT) | imipramine receptor
Type:
Multi-pass membrane protein
Mol. Mass.:
70168.43
Organism:
Rattus norvegicus (rat)
Description:
P31652
Residue:
630
  
Inhibitor
Name:
BDBM50042722
Synonyms:
2-Indan-5-yl-1-methyl-ethylamine | CHEMBL6842
Type:
Small organic molecule
Emp. Form.:
C12H17N
Mol. Mass.:
175.2701
SMILES:
CC(N)Cc1ccc2CCCc2c1
: