Target
Prolyl 4-hydroxylase
Ligand
BDBM50193145
Substrate
Meas. Tech.
ChEMBL_1840409 (CHEMBL4340708)
Ki
710±n/a nM
Citation
 Langley, GWAbboud, MILohans, CTSchofield, CJ Inhibition of a viral prolyl hydroxylase. Bioorg Med Chem 27:2405-2412 (2019)  
Target
Name:
Prolyl 4-hydroxylase
Synonyms:
A085R | Prolyl 4-hydroxylase
Type:
PROTEIN
Mol. Mass.:
27815.10
Organism:
Paramecium bursaria Chlorella virus 1
Description:
ChEMBL_119118
Residue:
242
  
Inhibitor
Name:
BDBM50193145
Synonyms:
2-(1-chloro-4-hydroxyisoquinoline-3-carboxamido)acetic acid Isoquinoline 3 | N-[(1-CHLORO-4-HYDROXYISOQUINOLIN-3-YL)CARBONYL]GLYCINE
Type:
Small organic molecule
Emp. Form.:
C12H9ClN2O4
Mol. Mass.:
280.664
SMILES:
OC(=O)CNC(=O)c1nc(Cl)c2ccccc2c1O
: