Target
Nuclear receptor ROR-gamma
Ligand
BDBM50510357
Substrate
Meas. Tech.
ChEMBL_1841441 (CHEMBL4341740)
IC50
8.0±n/a nM
Citation
 Tanis, VMVenkatesan, HCummings, MDAlbers, MKent Barbay, JHerman, KKummer, DAMilligan, CNelen, MINishimura, RSchlueter, TScott, BSpurlino, JWolin, RWoods, CXue, XEdwards, JPFourie, AMLeonard, K 3-Substituted Quinolines as ROR?t Inverse Agonists. Bioorg Med Chem Lett 29:1463-1470 (2019)  
Target
Name:
Nuclear receptor ROR-gamma
Synonyms:
NR1F3 Nuclear receptor ROR-gamma (RORC) RAR-related orphan receptor C (RORc) RORG RZRG Retinoid-related orphan receptor-gamma (RORc)
Type:
Enzyme Catalytic Domain
Mol. Mass.:
58218.40
Organism:
Homo sapiens (Human)
Description:
P51449
Residue:
518
  
Inhibitor
Name:
BDBM50510357
Synonyms:
CHEMBL4543938
Type:
Small organic molecule
Emp. Form.:
C27H25ClF6N6O2
Mol. Mass.:
614.97
SMILES:
COc1nc2ccc(cc2c(Cl)c1CN1CCC(CC1)C(F)(F)F)C(O)(c1cnnn1C)c1ccnc(c1)C(F)(F)F
: