Target
Nuclear receptor ROR-gamma
Ligand
BDBM50510353
Substrate
Meas. Tech.
ChEMBL_1841438 (CHEMBL4341737)
EC50
38±n/a nM
Citation
 Tanis, VMVenkatesan, HCummings, MDAlbers, MKent Barbay, JHerman, KKummer, DAMilligan, CNelen, MINishimura, RSchlueter, TScott, BSpurlino, JWolin, RWoods, CXue, XEdwards, JPFourie, AMLeonard, K 3-Substituted Quinolines as ROR?t Inverse Agonists. Bioorg Med Chem Lett 29:1463-1470 (2019)  
Target
Name:
Nuclear receptor ROR-gamma
Synonyms:
NR1F3 Nuclear receptor ROR-gamma (RORC) RAR-related orphan receptor C (RORc) RORG RZRG Retinoid-related orphan receptor-gamma (RORc)
Type:
Enzyme Catalytic Domain
Mol. Mass.:
58218.40
Organism:
Homo sapiens (Human)
Description:
P51449
Residue:
518
  
Inhibitor
Name:
BDBM50510353
Synonyms:
CHEMBL4589288
Type:
Small organic molecule
Emp. Form.:
C25H23ClN6O3S
Mol. Mass.:
523.007
SMILES:
COc1nc2ccc(cc2c(Cl)c1OCc1nccs1)C(O)(c1cnnn1C)c1ccc(C)nc1C
: