Target
Nuclear receptor ROR-gamma
Ligand
BDBM339267
Substrate
Meas. Tech.
ChEMBL_1841433 (CHEMBL4341732)
Kd
412±n/a nM
Citation
 Tanis, VMVenkatesan, HCummings, MDAlbers, MKent Barbay, JHerman, KKummer, DAMilligan, CNelen, MINishimura, RSchlueter, TScott, BSpurlino, JWolin, RWoods, CXue, XEdwards, JPFourie, AMLeonard, K 3-Substituted Quinolines as ROR?t Inverse Agonists. Bioorg Med Chem Lett 29:1463-1470 (2019)  
Target
Name:
Nuclear receptor ROR-gamma
Synonyms:
NR1F3 Nuclear receptor ROR-gamma (RORC) RAR-related orphan receptor C (RORc) RORG RZRG Retinoid-related orphan receptor-gamma (RORc)
Type:
Enzyme Catalytic Domain
Mol. Mass.:
58218.40
Organism:
Homo sapiens (Human)
Description:
P51449
Residue:
518
  
Inhibitor
Name:
BDBM339267
Synonyms:
US10201546, Example 133a
Type:
Small organic molecule
Emp. Form.:
C25H28ClN5O2
Mol. Mass.:
465.975
SMILES:
COc1nc2ccc(cc2c(Cl)c1CC(C)C)C(O)(c1cnnn1C)c1ccc(C)nc1C
: