Target
Nuclear receptor ROR-gamma
Ligand
BDBM50510359
Substrate
Meas. Tech.
ChEMBL_1841432 (CHEMBL4341731)
IC50
280±n/a nM
Citation
 Tanis, VMVenkatesan, HCummings, MDAlbers, MKent Barbay, JHerman, KKummer, DAMilligan, CNelen, MINishimura, RSchlueter, TScott, BSpurlino, JWolin, RWoods, CXue, XEdwards, JPFourie, AMLeonard, K 3-Substituted Quinolines as ROR?t Inverse Agonists. Bioorg Med Chem Lett 29:1463-1470 (2019)  
Target
Name:
Nuclear receptor ROR-gamma
Synonyms:
NR1F3 Nuclear receptor ROR-gamma (RORC) RAR-related orphan receptor C (RORc) RORG RZRG Retinoid-related orphan receptor-gamma (RORc)
Type:
Enzyme Catalytic Domain
Mol. Mass.:
58218.40
Organism:
Homo sapiens (Human)
Description:
P51449
Residue:
518
  
Inhibitor
Name:
BDBM50510359
Synonyms:
CHEMBL4466031
Type:
Small organic molecule
Emp. Form.:
C27H30ClN5O4S
Mol. Mass.:
556.076
SMILES:
COc1nc2ccc(cc2c(Cl)c1CC1CCS(=O)(=O)CC1)C(O)(c1cnnn1C)c1ccc(C)nc1C
: