Target
P2X purinoceptor 3
Ligand
BDBM85043
Substrate
Meas. Tech.
ChEMBL_162330 (CHEMBL766585)
IC50
240000±n/a nM
Citation
 Jacobson, KAKim, YCWildman, SSMohanram, AHarden, TKBoyer, JLKing, BFBurnstock, G A pyridoxine cyclic phosphate and its 6-azoaryl derivative selectively potentiate and antagonize activation of P2X1 receptors. J Med Chem 41:2201-6 (1998)  
Target
Name:
P2X purinoceptor 3
Synonyms:
ATP receptor P2X purinoceptor 3 P2rx3 ratp2x3 | ratp2x3 + rsa
Type:
Enzyme Catalytic Domain
Mol. Mass.:
44397.63
Organism:
RAT
Description:
Purinergic, P2X3 0 RAT::P49654
Residue:
397
  
Inhibitor
Name:
BDBM85043
Synonyms:
CAS_149017-66-3 NSC_6093163 | PPADS
Type:
Small organic molecule
Emp. Form.:
C14H14N3O12PS2
Mol. Mass.:
511.378
SMILES:
Cc1nc(N=Nc2ccc(cc2S(O)(=O)=O)S(O)(=O)=O)c(COP(O)(O)=O)c(C=O)c1O
: