Target
Neuraminidase
Ligand
BDBM5025
Substrate
Meas. Tech.
ChEMBL_1842027 (CHEMBL4342326)
Ki
860±n/a nM
Citation
 Zima, VAlbińana, CBRojíková, KPokorná, JPachl, P?ezá?ová, PHudlicky, JNavrátil, VMajer, PKonvalinka, JKo?í?ek, MMachara, A Investigation of flexibility of neuraminidase 150-loop using tamiflu derivatives in influenza A viruses H1N1 and H5N1. Bioorg Med Chem 27:2935-2947 (2019)  
Target
Name:
Neuraminidase
Synonyms:
Influenza A Virus Neuraminidase NRAM_I34A1 Neuraminidase A
Type:
Enzyme
Mol. Mass.:
50124.14
Organism:
Influenza A virus (A/Puerto Rico/8/34/Mount Sinai(H1N1))
Description:
P03468
Residue:
454
  
Inhibitor
Name:
BDBM5025
Synonyms:
Oseltamivir ethyl (3R,4R,5S)-5-amino-4-acetamido-3-(pentan-3-yloxy)cyclohex-1-ene-1-carboxylate
Type:
Small organic molecule
Emp. Form.:
C16H28N2O4
Mol. Mass.:
312.4045
SMILES:
[H][C@@]1(OC(CC)CC)C=C(C[C@H](N)[C@H]1NC(C)=O)C(=O)OCC
: