Target
Beta-secretase 2
Ligand
BDBM50510775
Substrate
Meas. Tech.
ChEMBL_1842185 (CHEMBL4342612)
IC50
1.000000±n/a nM
Citation
 Hsiao, CCRombouts, FGijsen, HJM New evolutions in the BACE1 inhibitor field from 2014 to 2018. Bioorg Med Chem Lett 29:761-777 (2019)  
Target
Name:
Beta-secretase 2
Synonyms:
AEPLC ASP1 Asp 1 Aspartyl protease 1 BACE2_HUMAN Beta-secretase (BACE) Beta-secretase 2 (BACE-2) Beta-site APP-cleaving enzyme 2 Memapsin-1 beta-Secretase (BACE-2)
Type:
Protein
Mol. Mass.:
56171.20
Organism:
Homo sapiens (Human)
Description:
Q9Y5Z0
Residue:
518
  
Inhibitor
Name:
BDBM50510775
Synonyms:
CHEMBL4445405
Type:
Small organic molecule
Emp. Form.:
C19H17F5N4O2S
Mol. Mass.:
460.421
SMILES:
C[C@]1(C[C@H](SC(N)=N1)C(F)(F)F)c1cc(NC(=O)c2ccc(OCF)cn2)ccc1F
: