Target
Beta-secretase 2
Ligand
BDBM50510816
Substrate
Meas. Tech.
ChEMBL_1842185 (CHEMBL4342612)
IC50
0.500000±n/a nM
Citation
 Hsiao, CCRombouts, FGijsen, HJM New evolutions in the BACE1 inhibitor field from 2014 to 2018. Bioorg Med Chem Lett 29:761-777 (2019)  
Target
Name:
Beta-secretase 2
Synonyms:
AEPLC ASP1 Asp 1 Aspartyl protease 1 BACE2_HUMAN Beta-secretase (BACE) Beta-secretase 2 (BACE-2) Beta-site APP-cleaving enzyme 2 Memapsin-1 beta-Secretase (BACE-2)
Type:
Protein
Mol. Mass.:
56171.20
Organism:
Homo sapiens (Human)
Description:
Q9Y5Z0
Residue:
518
  
Inhibitor
Name:
BDBM50510816
Synonyms:
CHEMBL4475802
Type:
Small organic molecule
Emp. Form.:
C20H20F4N4O2S
Mol. Mass.:
456.457
SMILES:
CC(F)(F)[C@@H]1C[C@](C)(N=C(N)S1)c1cc(NC(=O)c2ccc(OCF)cn2)ccc1F
: