Target
5-hydroxytryptamine receptor 7
Ligand
BDBM10755
Substrate
Meas. Tech.
ChEMBL_1842607 (CHEMBL4343034)
EC50
5.4±n/a nM
Citation
 Czopek, ABucki, AKo?aczkowski, MZagórska, ADrop, MPaw?owski, MSiwek, AG?uch-Lutwin, MP?kala, EChrzanowska, AStruga, MPartyka, AWeso?owska, A Novel multitarget 5-arylidenehydantoins with arylpiperazinealkyl fragment: Pharmacological evaluation and investigation of cytotoxicity and metabolic stability. Bioorg Med Chem 27:4163-4173 (2019)  
Target
Name:
5-hydroxytryptamine receptor 7
Synonyms:
5-HT-7 5-HT7 5-HT7S 5HT7 HTR7 | Serotonin receptor 7
Type:
G Protein-Coupled Receptor (GPCR)
Mol. Mass.:
53573.08
Organism:
Homo sapiens (Human)
Description:
P34969
Residue:
479
  
Inhibitor
Name:
BDBM10755
Synonyms:
14C-5-hydroxy tryptamine creatinine disulfate 5-HT 5-hydroxy tryptamine creatinine disulfate Serotonin | [3H]-5-HT
Type:
Small organic molecule
Emp. Form.:
C10H12N2O
Mol. Mass.:
176.2151
SMILES:
NCCc1c[nH]c2ccc(O)cc12
: