Target
Platelet-activating factor receptor
Ligand
BDBM50065345
Substrate
Meas. Tech.
ChEMBL_158346 (CHEMBL768490)
IC50
4800±n/a nM
Citation
 Han, BHYang, HOKang, YHSuh, DYGo, HJSong, WJKim, YCPark, MK In vitro platelet-activating factor receptor binding inhibitory activity of pinusolide derivatives: a structure-activity study. J Med Chem 41:2626-30 (1998)  
Target
Name:
Platelet-activating factor receptor
Synonyms:
PAF-R PTAFR_CAVPO Platelet-activating factor receptor
Type:
Protein
Mol. Mass.:
39005.63
Organism:
Cavia porcellus
Description:
Residue:
342
  
Inhibitor
Name:
BDBM50065345
Synonyms:
(1S,4aR,5S)-1,4a,6-Trimethyl-5-[2-(2-oxo-tetrahydro-furan-3-yl)-ethyl]-decahydro-naphthalene-1-carboxylic acid methyl ester | CHEMBL88886
Type:
Small organic molecule
Emp. Form.:
C21H34O4
Mol. Mass.:
350.4923
SMILES:
COC(=O)[C@@]1(C)CCC[C@]2(C)[C@@H](CCC3CCOC3=O)C(C)CCC12
: