Target
Platelet-activating factor receptor
Ligand
BDBM50065333
Substrate
Meas. Tech.
ChEMBL_158346 (CHEMBL768490)
IC50
4000±n/a nM
Citation
 Han, BHYang, HOKang, YHSuh, DYGo, HJSong, WJKim, YCPark, MK In vitro platelet-activating factor receptor binding inhibitory activity of pinusolide derivatives: a structure-activity study. J Med Chem 41:2626-30 (1998)  
Target
Name:
Platelet-activating factor receptor
Synonyms:
PAF-R PTAFR_CAVPO Platelet-activating factor receptor
Type:
Protein
Mol. Mass.:
39005.63
Organism:
Cavia porcellus
Description:
Residue:
342
  
Inhibitor
Name:
BDBM50065333
Synonyms:
6-Hydroxymethyl-1,4a-dimethyl-5-[2-(2-oxo-2,5-dihydro-furan-3-yl)-ethyl]-1,2,3,4,4a,7,8,8a-octahydro-naphthalene-1-carboxylic acid methyl ester | CHEMBL314343
Type:
Small organic molecule
Emp. Form.:
C21H30O5
Mol. Mass.:
362.4599
SMILES:
COC(=O)[C@@]1(C)CCC[C@@]2(C)C1CCC(CO)=C2CCC1=CCOC1=O
: