Target
Platelet-activating factor receptor
Ligand
BDBM50065350
Substrate
Meas. Tech.
ChEMBL_158346 (CHEMBL768490)
IC50
23000±n/a nM
Citation
 Han, BHYang, HOKang, YHSuh, DYGo, HJSong, WJKim, YCPark, MK In vitro platelet-activating factor receptor binding inhibitory activity of pinusolide derivatives: a structure-activity study. J Med Chem 41:2626-30 (1998)  
Target
Name:
Platelet-activating factor receptor
Synonyms:
PAF-R PTAFR_CAVPO Platelet-activating factor receptor
Type:
Protein
Mol. Mass.:
39005.63
Organism:
Cavia porcellus
Description:
Residue:
342
  
Inhibitor
Name:
BDBM50065350
Synonyms:
(1S,4aR,5S)-1,4a-Dimethyl-6-methylene-5-[2-(2-oxo-2,5-dihydro-furan-3-yl)-ethyl]-decahydro-naphthalene-1-carboxylic acid | CHEMBL90504
Type:
Small organic molecule
Emp. Form.:
C20H28O4
Mol. Mass.:
332.4339
SMILES:
C[C@]12CCC[C@@](C)(C1CCC(=C)[C@@H]2CCC1=CCOC1=O)C(O)=O
: