Target
Platelet-activating factor receptor
Ligand
BDBM50065339
Substrate
Meas. Tech.
ChEMBL_158346 (CHEMBL768490)
IC50
1700±n/a nM
Citation
 Han, BHYang, HOKang, YHSuh, DYGo, HJSong, WJKim, YCPark, MK In vitro platelet-activating factor receptor binding inhibitory activity of pinusolide derivatives: a structure-activity study. J Med Chem 41:2626-30 (1998)  
Target
Name:
Platelet-activating factor receptor
Synonyms:
PAF-R PTAFR_CAVPO Platelet-activating factor receptor
Type:
Protein
Mol. Mass.:
39005.63
Organism:
Cavia porcellus
Description:
Residue:
342
  
Inhibitor
Name:
BDBM50065339
Synonyms:
(1S,4aS)-6-Formyl-1,4a-dimethyl-5-[2-(2-oxo-2,5-dihydro-furan-3-yl)-ethyl]-1,2,3,4,4a,7,8,8a-octahydro-naphthalene-1-carboxylic acid methyl ester | CHEMBL86916
Type:
Small organic molecule
Emp. Form.:
C21H28O5
Mol. Mass.:
360.444
SMILES:
COC(=O)[C@@]1(C)CCC[C@@]2(C)C1CCC(C=O)=C2CCC1=CCOC1=O
: