Target
Platelet-activating factor receptor
Ligand
BDBM50065351
Substrate
Meas. Tech.
ChEMBL_158346 (CHEMBL768490)
IC50
21000±n/a nM
Citation
 Han, BHYang, HOKang, YHSuh, DYGo, HJSong, WJKim, YCPark, MK In vitro platelet-activating factor receptor binding inhibitory activity of pinusolide derivatives: a structure-activity study. J Med Chem 41:2626-30 (1998)  
Target
Name:
Platelet-activating factor receptor
Synonyms:
PAF-R PTAFR_CAVPO Platelet-activating factor receptor
Type:
Protein
Mol. Mass.:
39005.63
Organism:
Cavia porcellus
Description:
Residue:
342
  
Inhibitor
Name:
BDBM50065351
Synonyms:
(Z)-2-[2-((1S,5S,8aR)-5-Hydroxymethyl-5,8a-dimethyl-2-methylene-decahydro-naphthalen-1-yl)-ethyl]-but-2-ene-1,4-diol | CHEMBL315854
Type:
Small organic molecule
Emp. Form.:
C20H34O3
Mol. Mass.:
322.4822
SMILES:
C[C@]1(CO)CCC[C@]2(C)[C@@H](CC\C(CO)=C\CO)C(=C)CCC12
: