Target
Platelet-activating factor receptor
Ligand
BDBM50065335
Substrate
Meas. Tech.
ChEMBL_158346 (CHEMBL768490)
IC50
2000±n/a nM
Citation
 Han, BHYang, HOKang, YHSuh, DYGo, HJSong, WJKim, YCPark, MK In vitro platelet-activating factor receptor binding inhibitory activity of pinusolide derivatives: a structure-activity study. J Med Chem 41:2626-30 (1998)  
Target
Name:
Platelet-activating factor receptor
Synonyms:
PAF-R PTAFR_CAVPO Platelet-activating factor receptor
Type:
Protein
Mol. Mass.:
39005.63
Organism:
Cavia porcellus
Description:
Residue:
342
  
Inhibitor
Name:
BDBM50065335
Synonyms:
(1S,4aS,5R,6S)-6-Hydroxy-1,4a-dimethyl-5-[2-(2-oxo-2,5-dihydro-furan-3-yl)-ethyl]-decahydro-naphthalene-1-carboxylic acid methyl ester | CHEMBL314708
Type:
Small organic molecule
Emp. Form.:
C20H30O5
Mol. Mass.:
350.4492
SMILES:
COC(=O)[C@@]1(C)CCC[C@]2(C)[C@@H](CCC3=CCOC3=O)[C@@H](O)CCC12
: