Target
Perforin-1
Ligand
BDBM50510955
Substrate
Meas. Tech.
ChEMBL_1842690 (CHEMBL4343117)
IC50
7500±n/a nM
Citation
 Spicer, JAMiller, CKO'Connor, PDJose, JGiddens, ACJaiswal, JKJamieson, SMFBull, MRDenny, WAAkhlaghi, HTrapani, JAHill, GRChang, KGartlan, KH Inhibition of the Cytolytic Protein Perforin Prevents Rejection of Transplanted Bone Marrow Stem Cells in Vivo. J Med Chem 63:2229-2239 (2020)  
Target
Name:
Perforin-1
Synonyms:
PERF_HUMAN PRF1
Type:
PROTEIN
Mol. Mass.:
61392.32
Organism:
Homo sapiens (Human)
Description:
ChEMBL_1285138
Residue:
555
  
Inhibitor
Name:
BDBM50510955
Synonyms:
CHEMBL4547264
Type:
Small organic molecule
Emp. Form.:
C23H16F2N4O3S2
Mol. Mass.:
498.525
SMILES:
CN1Cc2cc(cnc2C1=O)-c1ccc(s1)-c1cncc(NS(=O)(=O)c2ccc(F)cc2F)c1
: