Target
Perforin-1
Ligand
BDBM50510959
Substrate
Meas. Tech.
ChEMBL_1842689 (CHEMBL4343116)
IC50
>20000±n/a nM
Citation
 Spicer, JAMiller, CKO'Connor, PDJose, JGiddens, ACJaiswal, JKJamieson, SMFBull, MRDenny, WAAkhlaghi, HTrapani, JAHill, GRChang, KGartlan, KH Inhibition of the Cytolytic Protein Perforin Prevents Rejection of Transplanted Bone Marrow Stem Cells in Vivo. J Med Chem 63:2229-2239 (2020)  
Target
Name:
Perforin-1
Synonyms:
PERF_HUMAN PRF1
Type:
PROTEIN
Mol. Mass.:
61392.32
Organism:
Homo sapiens (Human)
Description:
ChEMBL_1285138
Residue:
555
  
Inhibitor
Name:
BDBM50510959
Synonyms:
CHEMBL4530394
Type:
Small organic molecule
Emp. Form.:
C30H29F2N5O3S2
Mol. Mass.:
609.71
SMILES:
CN1CCN(CCN2Cc3cc(ccc3C2=O)-c2ccc(s2)-c2cncc(NS(=O)(=O)c3ccc(F)cc3F)c2)CC1
: