Target
Perforin-1
Ligand
BDBM50510956
Substrate
Meas. Tech.
ChEMBL_1842690 (CHEMBL4343117)
IC50
1600±n/a nM
Citation
 Spicer, JAMiller, CKO'Connor, PDJose, JGiddens, ACJaiswal, JKJamieson, SMFBull, MRDenny, WAAkhlaghi, HTrapani, JAHill, GRChang, KGartlan, KH Inhibition of the Cytolytic Protein Perforin Prevents Rejection of Transplanted Bone Marrow Stem Cells in Vivo. J Med Chem 63:2229-2239 (2020)  
Target
Name:
Perforin-1
Synonyms:
PERF_HUMAN PRF1
Type:
PROTEIN
Mol. Mass.:
61392.32
Organism:
Homo sapiens (Human)
Description:
ChEMBL_1285138
Residue:
555
  
Inhibitor
Name:
BDBM50510956
Synonyms:
CHEMBL4436700
Type:
Small organic molecule
Emp. Form.:
C24H19N5O6S2
Mol. Mass.:
537.568
SMILES:
COc1ncc(cc1NS(=O)(=O)c1ccccc1[N+]([O-])=O)-c1ccc(s1)-c1cnc2C(=O)N(C)Cc2c1
: