Target
Perforin-1
Ligand
BDBM50510961
Substrate
Meas. Tech.
ChEMBL_1842689 (CHEMBL4343116)
IC50
17000±n/a nM
Citation
 Spicer, JAMiller, CKO'Connor, PDJose, JGiddens, ACJaiswal, JKJamieson, SMFBull, MRDenny, WAAkhlaghi, HTrapani, JAHill, GRChang, KGartlan, KH Inhibition of the Cytolytic Protein Perforin Prevents Rejection of Transplanted Bone Marrow Stem Cells in Vivo. J Med Chem 63:2229-2239 (2020)  
Target
Name:
Perforin-1
Synonyms:
PERF_HUMAN PRF1
Type:
PROTEIN
Mol. Mass.:
61392.32
Organism:
Homo sapiens (Human)
Description:
ChEMBL_1285138
Residue:
555
  
Inhibitor
Name:
BDBM50510961
Synonyms:
CHEMBL4527624
Type:
Small organic molecule
Emp. Form.:
C29H26F2N4O4S2
Mol. Mass.:
596.668
SMILES:
Fc1ccc(c(F)c1)S(=O)(=O)Nc1cncc(c1)-c1ccc(s1)-c1ccc2C(=O)N(CCN3CCOCC3)Cc2c1
: