Target
Perforin-1
Ligand
BDBM50510954
Substrate
Meas. Tech.
ChEMBL_1842690 (CHEMBL4343117)
IC50
3400±n/a nM
Citation
 Spicer, JAMiller, CKO'Connor, PDJose, JGiddens, ACJaiswal, JKJamieson, SMFBull, MRDenny, WAAkhlaghi, HTrapani, JAHill, GRChang, KGartlan, KH Inhibition of the Cytolytic Protein Perforin Prevents Rejection of Transplanted Bone Marrow Stem Cells in Vivo. J Med Chem 63:2229-2239 (2020)  
Target
Name:
Perforin-1
Synonyms:
PERF_HUMAN PRF1
Type:
PROTEIN
Mol. Mass.:
61392.32
Organism:
Homo sapiens (Human)
Description:
ChEMBL_1285138
Residue:
555
  
Inhibitor
Name:
BDBM50510954
Synonyms:
CHEMBL4452449
Type:
Small organic molecule
Emp. Form.:
C24H17F3N4O3S2
Mol. Mass.:
530.542
SMILES:
CN1Cc2cc(cnc2C1=O)-c1ccc(s1)-c1cncc(NS(=O)(=O)c2cccc(c2)C(F)(F)F)c1
: