Target
5-hydroxytryptamine receptor 7
Ligand
BDBM50458532
Substrate
Meas. Tech.
ChEMBL_1842969 (CHEMBL4343396)
Ki
0.470000±n/a nM
Citation
 Thirumaran, SLLepailleur, ARochais, C Structure-activity relationships of serotonin 5-HT Eur J Med Chem 183:0 (2019)  
Target
Name:
5-hydroxytryptamine receptor 7
Synonyms:
5-HT-7 5-HT7 5-HT7S 5HT7 HTR7 | Serotonin receptor 7
Type:
G Protein-Coupled Receptor (GPCR)
Mol. Mass.:
53573.08
Organism:
Homo sapiens (Human)
Description:
P34969
Residue:
479
  
Inhibitor
Name:
BDBM50458532
Synonyms:
CHEMBL4216782
Type:
Small organic molecule
Emp. Form.:
C16H23N3O
Mol. Mass.:
273.3733
SMILES:
CN(C)CCc1cc(ccc1O)-c1c(C)nn(C)c1C
: