Target
Cannabinoid receptor 2
Ligand
BDBM21281
Substrate
Meas. Tech.
ChEMBL_1843636 (CHEMBL4344063)
Ki
1.7±n/a nM
Citation
 Linciano, PCitti, CLuongo, LBelardo, CMaione, SVandelli, MAForni, FGigli, GLaganą, AMontone, CMCannazza, G Isolation of a High-Affinity Cannabinoid for the Human CB1 Receptor from a Medicinal  J Nat Prod 83:88-98 (2020)  
Target
Name:
Cannabinoid receptor 2
Synonyms:
CANNABINOID CB2 CB2 CB2B CNR2_HUMAN Cannabinoid CB2 receptor Cannabinoid receptor 2 (CB2R) | hCB2
Type:
G Protein-Coupled Receptor (GPCR)
Mol. Mass.:
39690.94
Organism:
Homo sapiens (Human)
Description:
P34972
Residue:
360
  
Inhibitor
Name:
BDBM21281
Synonyms:
(11R)-2-methyl-11-(morpholin-4-ylmethyl)-3-(naphthalen-1-ylcarbonyl)-9-oxa-1-azatricyclo[6.3.1.0^{4,12}]dodeca-2,4(12),5,7-tetraene CHEMBL188 WIN 55212-2 WIN55212-2
Type:
Analgesic
Emp. Form.:
C27H26N2O3
Mol. Mass.:
426.5069
SMILES:
Cc1c(C(=O)c2cccc3ccccc23)c2cccc3OC[C@@H](CN4CCOCC4)n1c23
: