Target
Cannabinoid receptor 2
Ligand
BDBM50511104
Substrate
Meas. Tech.
ChEMBL_1843636 (CHEMBL4344063)
Ki
51±n/a nM
Citation
 Linciano, PCitti, CLuongo, LBelardo, CMaione, SVandelli, MAForni, FGigli, GLaganą, AMontone, CMCannazza, G Isolation of a High-Affinity Cannabinoid for the Human CB1 Receptor from a Medicinal  J Nat Prod 83:88-98 (2020)  
Target
Name:
Cannabinoid receptor 2
Synonyms:
CANNABINOID CB2 CB2 CB2B CNR2_HUMAN Cannabinoid CB2 receptor Cannabinoid receptor 2 (CB2R) | hCB2
Type:
G Protein-Coupled Receptor (GPCR)
Mol. Mass.:
39690.94
Organism:
Homo sapiens (Human)
Description:
P34972
Residue:
360
  
Inhibitor
Name:
BDBM50511104
Synonyms:
CHEMBL4437290
Type:
Small organic molecule
Emp. Form.:
C20H28O2
Mol. Mass.:
300.4351
SMILES:
[H][C@@]12C=C(C)CC[C@@]1([H])C(C)(C)Oc1cc(CCCC)cc(O)c21
: