Target
Phosphatidylinositol 5-phosphate 4-kinase type-2 beta
Ligand
BDBM50511409
Substrate
Meas. Tech.
ChEMBL_1844802 (CHEMBL4345229)
IC50
3800±n/a nM
Citation
 Manz, TDSivakumaren, SCYasgar, AHall, MDDavis, MISeo, HSCard, JDFicarro, SBShim, HMarto, JADhe-Paganon, SSasaki, ATBoxer, MBSimeonov, ACantley, LCShen, MZhang, TFerguson, FMGray, NS Structure-Activity Relationship Study of Covalent Pan-phosphatidylinositol 5-Phosphate 4-Kinase Inhibitors. ACS Med Chem Lett 11:346-352 (2020)  
Target
Name:
Phosphatidylinositol 5-phosphate 4-kinase type-2 beta
Synonyms:
PI42B_HUMAN PIP5K2B | Phosphatidylinositol-5-phosphate 4-kinase type-2 beta
Type:
PROTEIN
Mol. Mass.:
47382.97
Organism:
Homo sapiens (Human)
Description:
ChEMBL_774395
Residue:
416
  
Inhibitor
Name:
BDBM50511409
Synonyms:
Imanixil
Type:
Small organic molecule
Emp. Form.:
C17H17F3N6O2
Mol. Mass.:
394.3511
SMILES:
CC1(C)CN(C(=O)N1)c1ncc(C(=O)Nc2cccc(c2)C(F)(F)F)c(N)n1
: