Target
Phosphatidylinositol 5-phosphate 4-kinase type-2 beta
Ligand
BDBM50511416
Substrate
Meas. Tech.
ChEMBL_1844802 (CHEMBL4345229)
IC50
24500±n/a nM
Citation
 Manz, TDSivakumaren, SCYasgar, AHall, MDDavis, MISeo, HSCard, JDFicarro, SBShim, HMarto, JADhe-Paganon, SSasaki, ATBoxer, MBSimeonov, ACantley, LCShen, MZhang, TFerguson, FMGray, NS Structure-Activity Relationship Study of Covalent Pan-phosphatidylinositol 5-Phosphate 4-Kinase Inhibitors. ACS Med Chem Lett 11:346-352 (2020)  
Target
Name:
Phosphatidylinositol 5-phosphate 4-kinase type-2 beta
Synonyms:
PI42B_HUMAN PIP5K2B | Phosphatidylinositol-5-phosphate 4-kinase type-2 beta
Type:
PROTEIN
Mol. Mass.:
47382.97
Organism:
Homo sapiens (Human)
Description:
ChEMBL_774395
Residue:
416
  
Inhibitor
Name:
BDBM50511416
Synonyms:
CHEMBL4537067
Type:
Small organic molecule
Emp. Form.:
C35H33N7O2
Mol. Mass.:
583.6822
SMILES:
CN(C)C\C=C\C(=O)Nc1ccc(cc1)C(=O)Nc1cccc(Nc2cc(Nc3cccc(c3)-c3ccccc3)ncn2)c1
: