Target
Phosphatidylinositol 5-phosphate 4-kinase type-2 alpha
Ligand
BDBM50511424
Substrate
Meas. Tech.
ChEMBL_1844801 (CHEMBL4345228)
IC50
6500±n/a nM
Citation
 Manz, TDSivakumaren, SCYasgar, AHall, MDDavis, MISeo, HSCard, JDFicarro, SBShim, HMarto, JADhe-Paganon, SSasaki, ATBoxer, MBSimeonov, ACantley, LCShen, MZhang, TFerguson, FMGray, NS Structure-Activity Relationship Study of Covalent Pan-phosphatidylinositol 5-Phosphate 4-Kinase Inhibitors. ACS Med Chem Lett 11:346-352 (2020)  
Target
Name:
Phosphatidylinositol 5-phosphate 4-kinase type-2 alpha
Synonyms:
1-phosphatidylinositol 5-phosphate 4-kinase 2-alpha Diphosphoinositide kinase 2-alpha PI42A_HUMAN PIP4K2A PIP5K2 PIP5KIII Phosphatidylinositol 5-phosphate 4-kinase type-2 alpha PtdIns(4)P-5-kinase B isoform PtdIns(5)P-4-kinase isoform 2-alpha
Type:
PROTEIN
Mol. Mass.:
46228.59
Organism:
Homo sapiens
Description:
ChEMBL_104274
Residue:
406
  
Inhibitor
Name:
BDBM50511424
Synonyms:
CHEMBL4518868
Type:
Small organic molecule
Emp. Form.:
C31H30N8O2
Mol. Mass.:
546.6223
SMILES:
CN(C)C\C=C\C(=O)Nc1ccc(cc1)C(=O)Nc1ccc(C)c(Nc2cc(ncn2)-c2cnc3[nH]ccc3c2)c1
: