Target
Steroidogenic factor 1
Ligand
BDBM50511469
Substrate
Meas. Tech.
ChEMBL_1844859 (CHEMBL4345286)
Kd
12±n/a nM
Citation
 D'Agostino, EHFlynn, ARCornelison, JLMays, SGPatel, AJui, NTOrtlund, EA Development of a Versatile and Sensitive Direct Ligand Binding Assay for Human NR5A Nuclear Receptors. ACS Med Chem Lett 11:365-370 (2020)  
Target
Name:
Steroidogenic factor 1
Synonyms:
AD4BP FTZF1 NR5A1 SF-1 STF-1 Steroid hormone receptor Ad4BP
Type:
Nuclear Hormone Receptor
Mol. Mass.:
51643.43
Organism:
Homo sapiens (Human)
Description:
Residue:
461
  
Inhibitor
Name:
BDBM50511469
Synonyms:
CHEMBL4515639
Type:
Small organic molecule
Emp. Form.:
C52H53N3O8S
Mol. Mass.:
880.058
SMILES:
[H][C@@]12CC(CCCCCCCCCC(=O)Nc3ccc4c(c3)C(=O)OC43c4ccc(O)cc4Oc4cc(O)ccc34)=C(c3ccccc3)[C@@]1(CC[C@@H]2NS(N)(=O)=O)C(=C)c1ccccc1
: