Target
Steroidogenic factor 1
Ligand
BDBM50418303
Substrate
Meas. Tech.
ChEMBL_1844866 (CHEMBL4345293)
Kd
1200±n/a nM
Citation
 D'Agostino, EHFlynn, ARCornelison, JLMays, SGPatel, AJui, NTOrtlund, EA Development of a Versatile and Sensitive Direct Ligand Binding Assay for Human NR5A Nuclear Receptors. ACS Med Chem Lett 11:365-370 (2020)  
Target
Name:
Steroidogenic factor 1
Synonyms:
AD4BP FTZF1 NR5A1 SF-1 STF-1 Steroid hormone receptor Ad4BP
Type:
Nuclear Hormone Receptor
Mol. Mass.:
51643.43
Organism:
Homo sapiens (Human)
Description:
Residue:
461
  
Inhibitor
Name:
BDBM50418303
Synonyms:
CHEMBL1765959
Type:
Small organic molecule
Emp. Form.:
C28H34O
Mol. Mass.:
386.569
SMILES:
CCCCCCC1=C(c2ccccc2)[C@@]2(CC[C@@H](O)[C@@H]2C1)C(=C)c1ccccc1
: