Target
Cyclin-dependent kinase 4
Ligand
BDBM91749
Substrate
Meas. Tech.
ChEMBL_1846253 (CHEMBL4346794)
Ki
>20000±n/a nM
Citation
 Tadesse, SCaldon, ECTilley, WWang, S Cyclin-Dependent Kinase 2 Inhibitors in Cancer Therapy: An Update. J Med Chem 62:4233-4251 (2019)  
Target
Name:
Cyclin-dependent kinase 4
Synonyms:
CDK4 Cell division protein kinase 4 PSK-J3
Type:
Enzyme Subunit
Mol. Mass.:
33731.96
Organism:
Homo sapiens (Human)
Description:
P11802
Residue:
303
  
Inhibitor
Name:
BDBM91749
Synonyms:
CS16
Type:
Emp. Form.:
C15H13N5O2S
Mol. Mass.:
327.361
SMILES:
Cc1nc(C)c(s1)-c1ccnc(Nc2cccc(c2)[N+]([O-])=O)n1
: