Target
Cyclin-dependent kinase 2
Ligand
BDBM10109
Substrate
Meas. Tech.
ChEMBL_1846255 (CHEMBL4346796)
IC50
3.0±n/a nM
Citation
 Tadesse, SCaldon, ECTilley, WWang, S Cyclin-Dependent Kinase 2 Inhibitors in Cancer Therapy: An Update. J Med Chem 62:4233-4251 (2019)  
Target
Name:
Cyclin-dependent kinase 2
Synonyms:
CDK2 CDK2_HUMAN Cell division protein kinase 2 Protein cereblon/Cyclin-dependent kinase 2 | p33 protein kinase
Type:
Enzyme Subunit
Mol. Mass.:
33938.17
Organism:
Homo sapiens (Human)
Description:
P24941
Residue:
298
  
Inhibitor
Name:
BDBM10109
Synonyms:
(3Z)-4-[(3R,4S,5R)-4-amino-3,5-dihydroxyhex-1-yn-1-yl]-5-fluoro-3-[(3-methoxy-1H-pyrrol-2-yl)methylidene]-2,3-dihydro-1H-indol-2-one | 4-alkynyl oxindole 7o
Type:
Small organic molecule
Emp. Form.:
C20H20FN3O4
Mol. Mass.:
385.3889
SMILES:
COc1cc[nH]c1\C=C1/C(=O)Nc2ccc(F)c(C#C[C@@H](O)[C@@H](N)[C@@H](C)O)c12
: