Target
Cyclin-A2/Cyclin-dependent kinase 2
Ligand
BDBM50511934
Substrate
Meas. Tech.
ChEMBL_1846226 (CHEMBL4346767)
IC50
0.700000±n/a nM
Citation
 Tadesse, SCaldon, ECTilley, WWang, S Cyclin-Dependent Kinase 2 Inhibitors in Cancer Therapy: An Update. J Med Chem 62:4233-4251 (2019)  
Target
Name:
Cyclin-A2/Cyclin-dependent kinase 2
Synonyms:
CDK2-CyclinA CDK2/Cyclin A Cyclin A2/dependent kinase 2 Cyclin-Dependent Kinase 2 (CDK2A)
Type:
Protein Complex
Mol. Mass.:
Description:
Cdk2/Cyclin A kinase was purified from insect cells coinfected with Cyclin A/Cdk2 baculovirus.
Components:
This complex has 2 components.
Component 1
Name:
Cyclin-dependent kinase 2
Synonyms:
CDK2 CDK2_HUMAN Cell division protein kinase 2 Protein cereblon/Cyclin-dependent kinase 2 | p33 protein kinase
Type:
Enzyme Subunit
Mol. Mass.:
33938.17
Organism:
Homo sapiens (Human)
Description:
P24941
Residue:
298
  
Component 2
Name:
Cyclin-A2
Synonyms:
CCN1 CCNA1 CCNA2_HUMAN Cyclin-A
Type:
Enzyme Subunit
Mol. Mass.:
48550.19
Organism:
Homo sapiens (Human)
Description:
P20248
Residue:
432
  
Inhibitor
Name:
BDBM50511934
Synonyms:
CHEMBL4590821
Type:
Small organic molecule
Emp. Form.:
C19H26N6O5S
Mol. Mass.:
450.512
SMILES:
Nc1nc(Nc2ccc(cc2)S(=O)(=O)NCCO)nc(OCC2CCCCC2)c1N=O
: