Target
Adenosine receptor A2a
Ligand
BDBM50511956
Substrate
Meas. Tech.
ChEMBL_1846292 (CHEMBL4346833)
Ki
135±n/a nM
Citation
 Jiang, JSeel, CJTemirak, ANamasivayam, VArridu, ASchabikowski, JBaqi, YHinz, SHockemeyer, JMüller, CE A J Med Chem 62:4032-4055 (2019)  
Target
Name:
Adenosine receptor A2a
Synonyms:
A2A adenosine receptor (hA2A) ADENOSINE A2 ADORA2 Adenosine A2A receptor (A2AAR)
Type:
G Protein-Coupled Receptor (GPCR)
Mol. Mass.:
44716.46
Organism:
Homo sapiens (Human)
Description:
P29274
Residue:
412
  
Inhibitor
Name:
BDBM50511956
Synonyms:
CHEMBL4464175
Type:
Small organic molecule
Emp. Form.:
C26H29FN6O5S
Mol. Mass.:
556.609
SMILES:
CCCn1c(=O)[nH]c2nc([nH]c2c1=O)-c1ccc(cc1)S(=O)(=O)N1CCN(Cc2ccc(F)c(OC)c2)CC1
: