Target
3-oxoacyl-ACP synthase
Ligand
BDBM50512169
Substrate
Meas. Tech.
ChEMBL_1848049 (CHEMBL4348590)
IC50
21000±n/a nM
Citation
 Soheili, VTajani, ASGhodsi, RBazzaz, BSF Anti-PqsR compounds as next-generation antibacterial agents against Pseudomonas aeruginosa: A review. Eur J Med Chem 172:26-35 (2019)  
Target
Name:
3-oxoacyl-ACP synthase
Synonyms:
2-heptyl-4(1H)-quinolone synthase PqsD 3-oxoacyl-ACP synthase PA8380_44470 PQB biosynthetic 3-oxoacyl-[acyl-carrier-protein] synthase III pqsD
Type:
PROTEIN
Mol. Mass.:
36357.84
Organism:
Pseudomonas aeruginosa
Description:
ChEMBL_109728
Residue:
337
  
Inhibitor
Name:
BDBM50512169
Synonyms:
CHEMBL4587386
Type:
Small organic molecule
Emp. Form.:
C6H6N6O2S
Mol. Mass.:
226.216
SMILES:
CS(=O)(=O)c1nccc(n1)-n1cnnn1
: