Target
Beta-lactamase
Ligand
BDBM50067050
Substrate
Meas. Tech.
ChEMBL_40704 (CHEMBL654916)
IC50
>100000±n/a nM
Citation
 Heinze-Krauss, IAngehrn, PCharnas, RLGubernator, KGutknecht, EMHubschwerlen, CKania, MOefner, CPage, MGSogabe, SSpecklin, JLWinkler, F Structure-based design of beta-lactamase inhibitors. 1. Synthesis and evaluation of bridged monobactams. J Med Chem 41:3961-71 (1998)  
Target
Name:
Beta-lactamase
Synonyms:
AMPC_ECOLI Beta-lactamase (AmpC) Cephalosporinase ampA | ampC
Type:
Protien
Mol. Mass.:
41561.62
Organism:
Escherichia coli
Description:
P00811
Residue:
377
  
Inhibitor
Name:
BDBM50067050
Synonyms:
CHEMBL336630 | Sodium; (1S,5R)-7-oxo-2-(piperidin-4-ylcarbamoyl)-2,6-diaza-bicyclo[3.2.0]heptane-6-sulfonate
Type:
Small organic molecule
Emp. Form.:
C11H17N4O5S
Mol. Mass.:
317.342
SMILES:
[O-]S(=O)(=O)N1[C@@H]2CCN([C@@H]2C1=O)C(=O)NC1CCNCC1
: