Target
Urea transporter 1
Ligand
BDBM50512247
Substrate
Meas. Tech.
ChEMBL_1848172 (CHEMBL4348713)
IC50
220±n/a nM
Citation
 Zhao, YLi, MLi, BZhang, SSu, AXing, YGe, ZLi, RYang, B Discovery and optimization of thienopyridine derivatives as novel urea transporter inhibitors. Eur J Med Chem 172:131-142 (2019)  
Target
Name:
Urea transporter 1
Synonyms:
Slc14a1 UT1_RAT Urea transporter B (UT-B)
Type:
Protein
Mol. Mass.:
42037.85
Organism:
Rattus norvegicus (Rat)
Description:
Residue:
384
  
Inhibitor
Name:
BDBM50512247
Synonyms:
CHEMBL4545692
Type:
Small organic molecule
Emp. Form.:
C14H12N2O3S
Mol. Mass.:
288.322
SMILES:
COC(=O)c1sc2nc3ccc(OC)cc3cc2c1N
: