Target
Urea transporter 1
Ligand
BDBM50512259
Substrate
Meas. Tech.
ChEMBL_1848172 (CHEMBL4348713)
IC50
160±n/a nM
Citation
 Zhao, YLi, MLi, BZhang, SSu, AXing, YGe, ZLi, RYang, B Discovery and optimization of thienopyridine derivatives as novel urea transporter inhibitors. Eur J Med Chem 172:131-142 (2019)  
Target
Name:
Urea transporter 1
Synonyms:
Slc14a1 UT1_RAT Urea transporter B (UT-B)
Type:
Protein
Mol. Mass.:
42037.85
Organism:
Rattus norvegicus (Rat)
Description:
Residue:
384
  
Inhibitor
Name:
BDBM50512259
Synonyms:
CHEMBL4589155
Type:
Small organic molecule
Emp. Form.:
C13H9FN2O2S
Mol. Mass.:
276.286
SMILES:
COC(=O)c1sc2nc3ccc(F)cc3cc2c1N
: