Target
Tyrosine-protein kinase Blk
Ligand
BDBM50512346
Substrate
Meas. Tech.
ChEMBL_1848602 (CHEMBL4349143)
IC50
0.700000±n/a nM
Citation
 Tang, GLiu, LWang, XPan, Z Discovery of 7H-pyrrolo[2,3-d]pyrimidine derivatives as selective covalent irreversible inhibitors of interleukin-2-inducible T-cell kinase (Itk). Eur J Med Chem 173:167-183 (2019)  
Target
Name:
Tyrosine-protein kinase Blk
Synonyms:
B lymphoid tyrosine kinase BLK_HUMAN Tyrosine-protein kinase BLK (BLK) | p55-Blk
Type:
Protein
Mol. Mass.:
57711.88
Organism:
Homo sapiens (Human)
Description:
P51451
Residue:
505
  
Inhibitor
Name:
BDBM50512346
Synonyms:
CHEMBL4464404
Type:
Small organic molecule
Emp. Form.:
C30H27N7O3
Mol. Mass.:
533.5805
SMILES:
C=CC(=O)Nc1cccc(Oc2nc(Nc3ccc(cc3)N3CCOCC3)nc3[nH]cc(-c4ccncc4)c23)c1
: